{"text_format":"1","workbook":"xlsx","n_sheets":10,"sheets":["Instructions_First Time Use","Instructions","Reference Tables","DSV_App F Table 3-5 ","Performance Curve Example","Updates","Tables (hidden_locked)","Calcs (hidden_locked)","Input_Design_Output","Output_Summary"],"not_rendered":{"charts":0,"images":13,"macros":1,"external_links":0,"defined_names":141,"comments":0,"pivot_tables":0},"unopened":[],"bounds":{"document_bytes":16777216,"sheet_cells":100000,"rows_first":2000,"rows_last":500,"rows_between":2000,"halvings":0,"cell_chars":16384,"cell_head_chars":4096},"cells_cut":0,"cells_raw":0,"read":"whole","date_system":"1900"}

{"sheet":"Instructions_First Time Use","index":0,"n_rows":5,"n_cols":1,"rows_kept":5,"cut":false,"hidden":false,"merged":[]}
["Instructions for First Time Use"]
[]
["This workbook uses macros which need to be enabled for the first use only."]
[]
["By default, when you first open a macro-enabled workbook you’ll see a yellow “SECURITY WARNING” bar appear just underneath the ribbon.  Clicking the “Enable Content” button will enable macros."]

{"sheet":"Instructions","index":1,"n_rows":24,"n_cols":1,"rows_kept":24,"cut":false,"hidden":false,"merged":[]}
["Background"]
["This calculator provides estimates of long-term cumulative reduction credits for a variety of structural stormwater control measures (SCMs) based on design capacity relative to contributing impervious cover (IC) drainage area.  For structural SCMs, the design capacity is referred to as the Design Storage Volume (DSV) and is equal to the physical storage capacity of the SCM to hold water (e.g., ponding and void space volume).  The calculator also provides cumulative performance reduction estimates for semi-structural SCMs that accomplish diversion of IC runoff to receiving pervious areas (i.e., IC disconnection) based on the ratio of IC source area to receiving pervious area according to hydrologic soil group (HSG) type (e.g., 2:1, HSG A, B, C or D)).  The cumulative performance estimates represent the net reductions that would be accomplished if IC runoff from all storm events for long-term rainfall record (e.g., 20 years) were to be routed through the selected SCM.  The calculator includes average annual reduction estimates for total phosphorus, total nitrogen, total suspended solids, zinc, freshwater and marine water indicator bacteria, and runoff volume (only for infiltration SCMs).  The reduction estimates provided by this calculator are consistent with the methodologies used to develop the reduction estimates presented in Attachment 3 to Appendix F of the MA and NH MS4 permits (https://www3.epa.gov/region1/npdes/stormwater/nh/2017-appendix-f-attach-3-sms4-nh-mod.pdf).\n\nThis performance calculator uses the same values and performance data as presented in the MA and NH Small MS4 General Permit from EPA Region 1.  The land uses have been consolidated into 4 types consistent with the most representative categories in development scenarios.  The Stormwater Control Measures (SCM) or BMPs use the 10 classification categories outlined in the permit and infiltration rates by soil type range from 0.17 in/hr (HSG D soils) to 8.27 in/hr (HSG A soils).  As with simplified approaches, choose the most conservative category that generally represents site and system conditions."]
["\nObjective"]
["This calculator was designed to aid in SCM selection, design, and planning level performance assessment.  The performance objectives can be optimized by estimated pollutant load reduction, runoff volume reduction, cost, or other related outcomes.  Because this is primarily a design tool and not a tool for crediting, the mimimum depth of 0.1 inch is required for the Physical Storage Capacity (depth of runoff treated). While a PSC ≤ 0.1 inch will get credit using the BATT (an EPA approved crediting tool), a PSC of at least 0.1 inch should be targeted for design. To optimize cost/% treatment, the DSV should be optimized to treat a PSC of about 0.4 inch. This optimized point may be seen as the knee on the performance curves."]
["\nA note on drainage area delineation"]
["To simplify the estimates and aid in design, only impervious area (IA) is evaluated.  The x-axis on the performance curves is the depth of runoff treated over the IA. This runoff depth multiplied by the impervious area gives volume of water to be stored in the SCM void space, named the Design Storage Volume (DSV)."]
["\nA note of system selection"]
["Model your system according to the classification that best suits your treatment.  There are crosswalks available to help reference model system select.  Biofiltration assumes no infiltration thus if you want to model performance of bioretention where infiltration is enhanced or anticipated then you should model the system as an infiltration basin as that will more accurately account for volume losses to infiltration.  The DSV may require design assumptions for the porosity of various types of media.  We recommend using a porosity of 0.2 for soil media, 0.3 for sand or peastone, and 0.4 for large diameter reservoir stone."]
{"$rows_left_out":17}
{"sheet":"Reference Tables","index":2,"n_rows":39,"n_cols":8,"rows_kept":39,"cut":false,"hidden":false,"merged":[[1,1,1,2],[17,4,17,7],[18,4,18,7],[19,4,19,7],[20,4,20,7],[17,1,17,3],[18,1,18,3],[19,1,19,3],[20,1,20,3],[32,1,32,2],[21,1,21,3],[23,1,23,7],[25,3,25,5],[25,6,25,7],[21,4,21,7]]}
["Reference Tables"]
[null,"Crosswalk 1",null,"Costs","O&M"]
[null,"SCM 2","Applicable Performance Curve 3","Total Costs (2020) ($/cf DSV) 4","Annual Maintenance Hours (hr/ac/yr) 5"]
[null,{"$f":"'Tables (hidden_locked)'!P3","v":"Biofiltration   (w/ underdrain)"},{"$f":"'Tables (hidden_locked)'!Q3","v":"Biofiltration"},{"$f":"'Tables (hidden_locked)'!R3","v":15.870222769869997},{"$f":"'Tables (hidden_locked)'!S3","v":20.7}]
[null,{"$f":"'Tables (hidden_locked)'!P4","v":"Bioretention/Rain Garden  (no underdrains)"},{"$f":"'Tables (hidden_locked)'!Q4","v":"Infiltration Basin"},{"$f":"'Tables (hidden_locked)'!R4","v":15.870222769869997},{"$f":"'Tables (hidden_locked)'!S4","v":20.7}]
[null,{"$f":"'Tables (hidden_locked)'!P5","v":"Enhanced Biofiltration w/ Internal Storage Reservoir (ISR)  (no infiltration)"},{"$f":"'Tables (hidden_locked)'!Q5","v":"Enhanced Biofiltration With ISR"},{"$f":"'Tables (hidden_locked)'!R5","v":16.0245330885},{"$f":"'Tables (hidden_locked)'!S5","v":20.7}]
[null,{"$f":"'Tables (hidden_locked)'!P6","v":"Extended Dry Detention Basin"},{"$f":"'Tables (hidden_locked)'!Q6","v":"Dry Pond"},{"$f":"'Tables (hidden_locked)'!R6","v":6.9795744118799989},{"$f":"'Tables (hidden_locked)'!S6","v":24}]
[null,{"$f":"'Tables (hidden_locked)'!P7","v":"Gravel Wetland"},{"$f":"'Tables (hidden_locked)'!Q7","v":"Subsurface Gravel Wetland"},{"$f":"'Tables (hidden_locked)'!R7","v":9.0093486030899985},{"$f":"'Tables (hidden_locked)'!S7","v":21.7}]
{"$rows_left_out":32}
{"sheet":"DSV_App F Table 3-5 ","index":3,"n_rows":22,"n_cols":4,"rows_kept":22,"cut":false,"hidden":false,"merged":[[21,1,21,3],[20,1,20,3],[19,0,19,3],[0,0,0,3],[15,0,15,3],[16,0,16,3],[17,0,17,3],[18,0,18,3]]}
["Method for determining stormwater control design storage volume (DSV) (i.e., capacity) using Long-term cumulative performance curves1"]
["Stormwater Control Type","Description","Applicable Structural Stormwater Control Performance Curve ","Method for calculating Design Storage Capacity to Estimate Long-term Cumulative Reduction Performances  and Estimate Costs "]
["Infiltration Trench","Provides temporary storage of runoff using the void spaces within the soil/sand/gravel mixture that is used to backfill the trench for subsequent infiltration into the surrounding sub-soils. ","Infiltration Trench (6 infiltration  rates: 0.17, 0.27, 0.52, 1.02, 2.41 and 8.27 inches per hour)","DSV = void space volumes of stone and sand layers                      DSV = (Atrench x Dstone x nstone )+ (Atrench x Dsand x nsand)"]
["Surface Infiltration Practice  ","Provides temporary storage of runoff through surface ponding (e.g., basin or swale) for subsequent infiltration into the underlying soils. ","Surface Infiltration (6 infiltration  rates: 0.17, 0.27, 0.52, 1.02, 2.41 and 8.27 inches per hour)","DSV = Water volume of storage structure before bypass. Example for linear trapezoidal vegetated swale  \nDSV = (L x ((Wbottom+Wtop@Dmax )/2) x D)"]
["Bio-retention/Rain Garden  (no underdrains)","Provides temporary storage of runoff through surface ponding and possibly void spaces within the soil/sand/washed stone mixture that is used to filter runoff prior to infiltration into underlying soils.","Surface Infiltration (6 infiltration  rates: 0.17, 0.27, 0.52, 1.02, 2.41 and 8.27 inches per hour)","DSV = Ponding water storage volume and void space volumes of soil filter media:                                                                                            DSV = (Apond x Dpond) + (Asoil x Dsoil x nsoil mix) "]
["Subsurface Infiltration  ","Provides temporary storage of runoff using the combination of storage structures (e.g., galleys, chambers, pipes, etc.) and void spaces within the washed stone that is used to backfill the system for subsequent infiltration into the surrounding sub-soils. ","Infiltration Trench (6 infiltration  rates: 0.17, 0.27, 0.52, 1.02, 2.41 and 8.27 inches per hour)","DSV = Water storage volume of storage units and void space volumes of backfill materials. Example for subsurface galleys backfilled with washed stone:                                                               DSV = (L x W x D)galley + (Abackfill x Dstone x nstone) "]
["Bio-filtration   (w/underdrain)","Provides temporary surface ponding storage of runoff for filtering through an engineered soil media. The storage capacity includes void spaces in the filter media and temporary ponding at the surface.  After runoff has passed through the filter media it is collected by an under-drain pipe for discharge. Manufactured or packaged bio-filter systems such as tree box filters may be suitable for using the bio-filtration performance results. ","Bio-filtration ","DSV = Ponding water storage volume and void space volume of soil filter media.                                                                                              DSV =  (Abed x Dponding)+ (Abed x Dsoil x nsoil)  "]
["Enhanced Bio-filtration w/ Internal Storage Reservoir (ISR)  (no infiltration)","Provides temporary storage of runoff for filtering through an engineered soil media, augmented for enhanced phosphorus removal, followed by detention and denitrification in a subsurface internal storage reservoir (ISR) comprised of gravel.   An elevated outlet control at the top of the ISR is designed to provide a retention time of at least 24 hours in the system to allow for sufficient time for denitrification and nitrogen reduction to occur prior to discharge.  The design storage capacity for using the cumulative performance curves is comprised of void spaces in the filter media, temporary ponding at the surface of the practice and the void spaces in the gravel ISR.","Enhanced Bio-filtration w/ISR","DSV = Ponding water storage volume and void space volume of soil filter media and gravel ISR.                                                              DSV =  (Abed x Dponding)+ (Abed x Dsoil x nsoil) + (AISR x Dgravel  x ngravel) "]
{"$rows_left_out":15}
{"sheet":"Performance Curve Example","index":4,"n_rows":0,"n_cols":0,"rows_kept":0,"cut":false,"hidden":false,"merged":[]}

{"sheet":"Updates","index":5,"n_rows":4,"n_cols":3,"rows_kept":4,"cut":false,"hidden":true,"merged":[]}
["Version","Updates","Known issues to fix"]
[2,"major updates from v1, most important was removal of P and examples of design and credit calculation using performance curve","Input: Applicable Performance Curve for SCM2 - 5 not updating when new SCM selected"]
[2.1,"Input: Applicable Performance Curve for SCM2 - 5 update fix"]
[2.2000000000000002,"PSC=0 added to all tables for full interpolation. Warning language added based on PSC size to encourage mimimum and optimal sizing, orange input cell for surface basin and swale changed from W to Dponding. Added note to EPA DSV table for swale error"]

{"sheet":"Tables (hidden_locked)","index":6,"n_rows":412,"n_cols":51,"rows_kept":412,"cut":false,"hidden":true,"merged":[[0,0,4,0],[0,20,0,27],[0,35,0,50],[0,2,0,12],[0,15,0,16],[2,25,2,26],[2,22,2,24]]}
["*** All tables are saved as a defined name for use and quick updating in formulas. If the Name Manager values are correct and updated, all formulas should update immediately.",null,"Performance Curves",null,null,null,null,null,null,null,null,null,null,null,null,"Crosswalk",null,"Costs","O&M Hours",null,"Export Rates",null,null,null,null,null,null,null,null,"Bacteria Locations",null,"HSG","as numeric",null,null,"SCM Design Parameters (for conditional formatting)"]
[null,null,null,null,"Infiltration Rate (in/hr)","BMP Capacity: Depth of Runoff  from Impervious Area (inches)","Runoff Volume Reduction","Phosphorus Load Reduction"," Nitrogen Load Reduction","TSS Load Reduction","Zinc Load Reduction","Fecal Indicator Bacteria Load Reduction",null,null,null,"SCM","Applicable Performance Curve ","Total Costs (Rural x1) ($/DSV)","Annual Maintenance Hours (hr/yr/IC)",null,null,"Vol","P","N","TSS","E. coli","Enterococcus","Abbreviation",null,"Inland",null,"A",1,null,null,"design parameter",null,"Biofiltration   (w/ underdrain)","Bioretention/Rain Garden  (no underdrains)","Enhanced Biofiltration w/ Internal Storage Reservoir (ISR)  (no infiltration)","Extended Dry Detention Basin","Gravel Wetland","IC Disconnection","Infiltration Trench","Porous pavement w/ impermeable underliner & underdrain ","Porous Pavement w/ subsurface infiltration","Sand Filter w/ underdrain","Subsurface Infiltration  ","Surface Infiltration Practice","Water Quality Grass  Swale w/ Detention","Wet Pond"]
[null,null,null,"Curve","IR","PSC","Volume","TP","TN","TSS","TZn","FIB",null,null,null,"Biofiltration   (w/ underdrain)","Biofiltration",15.870222769869997,20.7,null,"Land Use","(cf/ac-yr)","(lb/ac-yr)",null,null,"(Billion MPN/ac/yr)",null,null,null,"Coastal",null,"B",2,null,null,"Width at top @ Dmax","WDmax",null,null,null,null,null,null,null,null,null,null,null,true,true]
[null,null,null,"Biofiltration",null,0,null,0,0,0,0,0,null,null,null,"Bioretention/Rain Garden  (no underdrains)","Infiltration Basin",15.870222769869997,20.7,null,"Low-Density Residential \"Rural\"",{"$f":"0.936*41.2/12*43560","v":139984.416},1.52,14.1,439,6.4,497,"Low Res.",null,null,null,"C",3,null,null,"Width at bed","Wbottom",null,null,null,null,null,null,null,null,null,null,null,true,true]
[null,null,null,"Biofiltration",null,0.1,null,0.14000000000000001,0.09,0.44,0.68,0.1099,null,null,null,"Enhanced Biofiltration w/ Internal Storage Reservoir (ISR)  (no infiltration)","Enhanced Biofiltration With ISR",16.0245330885,20.7,null,"Medium-Density Residential",{"$f":"0.936*41.2/12*43560","v":139984.416},1.96,14.1,439,6.4,497,"Med Res.",null,null,null,"D",4,null,null,"Area of pretreatment","Apretreatment",null,null,null,null,true,null,null,null,null,true]
[null,null,null,"Biofiltration",null,0.2,null,0.25,0.16,0.69,0.88,0.185,null,null,null,"Extended Dry Detention Basin","Dry Pond",6.9795744118799989,24,null,"Multi-Family and High-Density Residential",139984.416,2.3199999999999998,14.1,439,6.4,497,"Multi / High Res.",null,null,null,null,null,null,null,"Depth of pretreatment","Dpretreatment",null,null,null,null,true,null,null,null,null,true]
["Lookup Tables (locked and hidden)",null,null,"Biofiltration",null,0.4,null,0.37,0.23,0.91,0.95,0.30209999999999998,null,null,null,"Gravel Wetland","Subsurface Gravel Wetland",9.0093486030899985,21.7,null,"Commercial and Industrial",139984.416,1.78,15,377.4,6.4,497,"Comm. / Ind.",null,null,null,null,null,null,null,"Depth of filter course","DFC",null,null,null,null,null,null,null,true]
["performance curves",null,null,"Biofiltration",null,0.6,null,0.44,0.28000000000000003,0.97,0.96,0.40150000000000002,null,null,null,"IC Disconnection","IC Disconnection","Varies","Varies",null,null,null,null,null,null,null,null,null,null,null,null,null,null,null,null,"Area of pond","Apond",true,true,true,true,true,null,null,null,null,true,null,null,null,true]
{"$rows_left_out":405}
{"sheet":"Calcs (hidden_locked)","index":7,"n_rows":211,"n_cols":11,"rows_kept":211,"cut":false,"hidden":true,"merged":[]}
["calc notes",null,"Notes","Parameter","Abbrev.","Units","SCM 1","SCM 2","SCM 3","SCM 4","SCM 5"]
[null,"Input: \nSite & BMP","Site","ID",null,null,{"$f":"IF(ISBLANK(Input_Design_Output!F2),\"\",Input_Design_Output!F2)","v":"Example Bioretention"},{"$f":"IF(ISBLANK(Input_Design_Output!G2),\"\",Input_Design_Output!G2)","v":""},{"$f":"IF(ISBLANK(Input_Design_Output!H2),\"\",Input_Design_Output!H2)","v":""},{"$f":"IF(ISBLANK(Input_Design_Output!I2),\"\",Input_Design_Output!I2)","v":""},{"$f":"IF(ISBLANK(Input_Design_Output!J2),\"\",Input_Design_Output!J2)","v":""}]
[null,null,null,"Date",null,null,{"$f":"IF(ISBLANK(Input_Design_Output!F3),\"\",Input_Design_Output!F3)","v":44378},{"$f":"IF(ISBLANK(Input_Design_Output!G3),\"\",Input_Design_Output!G3)","v":""},{"$f":"IF(ISBLANK(Input_Design_Output!H3),\"\",Input_Design_Output!H3)","v":""},{"$f":"IF(ISBLANK(Input_Design_Output!I3),\"\",Input_Design_Output!I3)","v":""},{"$f":"IF(ISBLANK(Input_Design_Output!J3),\"\",Input_Design_Output!J3)","v":""}]
[null,null,null,"Location",null,null,{"$f":"IF(ISBLANK(Input_Design_Output!F4),\"\",Input_Design_Output!F4)","v":""},{"$f":"IF(ISBLANK(Input_Design_Output!G4),\"\",Input_Design_Output!G4)","v":""},{"$f":"IF(ISBLANK(Input_Design_Output!H4),\"\",Input_Design_Output!H4)","v":""},{"$f":"IF(ISBLANK(Input_Design_Output!I4),\"\",Input_Design_Output!I4)","v":""},{"$f":"IF(ISBLANK(Input_Design_Output!J4),\"\",Input_Design_Output!J4)","v":""}]
[null,null,null,"Description/Notes",null,null,{"$f":"IF(ISBLANK(Input_Design_Output!F5),\"\",Input_Design_Output!F5)","v":""},{"$f":"IF(ISBLANK(Input_Design_Output!G5),\"\",Input_Design_Output!G5)","v":""},{"$f":"IF(ISBLANK(Input_Design_Output!H5),\"\",Input_Design_Output!H5)","v":""},{"$f":"IF(ISBLANK(Input_Design_Output!I5),\"\",Input_Design_Output!I5)","v":""},{"$f":"IF(ISBLANK(Input_Design_Output!J5),\"\",Input_Design_Output!J5)","v":""}]
[null,null,null,"Costs Multiplier (Recommended 1-3)",null,null,{"$f":"IF(ISBLANK(Input_Design_Output!F6),\"\",Input_Design_Output!F6)","v":2},{"$f":"IF(ISBLANK(Input_Design_Output!G6),\"\",Input_Design_Output!G6)","v":""},{"$f":"IF(ISBLANK(Input_Design_Output!H6),\"\",Input_Design_Output!H6)","v":""},{"$f":"IF(ISBLANK(Input_Design_Output!I6),\"\",Input_Design_Output!I6)","v":""},{"$f":"IF(ISBLANK(Input_Design_Output!J6),\"\",Input_Design_Output!J6)","v":""}]
[null,null,null,"Location (for FIB)",null,null,{"$f":"IF(ISBLANK(Input_Design_Output!F7),\"\",Input_Design_Output!F7)","v":"Inland"},{"$f":"IF(ISBLANK(Input_Design_Output!G7),\"\",Input_Design_Output!G7)","v":""},{"$f":"IF(ISBLANK(Input_Design_Output!H7),\"\",Input_Design_Output!H7)","v":""},{"$f":"IF(ISBLANK(Input_Design_Output!I7),\"\",Input_Design_Output!I7)","v":""},{"$f":"IF(ISBLANK(Input_Design_Output!J7),\"\",Input_Design_Output!J7)","v":""}]
[null,null,"Watershed","Impervious Drainage Area","IA","ac",{"$f":"IF(ISBLANK(Input_Design_Output!F8),\"\",Input_Design_Output!F8)","v":0.84},{"$f":"IF(ISBLANK(Input_Design_Output!G8),\"\",Input_Design_Output!G8)","v":""},{"$f":"IF(ISBLANK(Input_Design_Output!H8),\"\",Input_Design_Output!H8)","v":""},{"$f":"IF(ISBLANK(Input_Design_Output!I8),\"\",Input_Design_Output!I8)","v":""},{"$f":"IF(ISBLANK(Input_Design_Output!J8),\"\",Input_Design_Output!J8)","v":""}]
{"$rows_left_out":204}
{"sheet":"Input_Design_Output","index":8,"n_rows":67,"n_cols":10,"rows_kept":67,"cut":false,"hidden":false,"merged":[[65,2,65,3],[66,2,66,3],[1,0,12,0],[14,0,34,0],[1,1,6,1],[7,1,8,1],[9,1,12,1],[14,1,34,1],[37,0,63,0],[41,1,46,1],[47,1,51,1],[52,1,56,1],[57,1,62,1],[37,1,40,1]]}
[null,"Notes","Parameter","Abbrev.","Units","SCM 1","SCM 2","SCM 3","SCM 4","SCM 5"]
["Input: \nSite & SCM","Site","ID",null,null,"Example Bioretention"]
[null,null,"Date",null,null,"2021-07-01"]
[null,null,"Location"]
[null,null,"Description/Notes"]
[null,null,"Costs Multiplier (Recommended 1-3)",null,null,2]
[null,null,"Location (for FIB)",null,null,"Inland"]
[null,"Watershed","Impervious Drainage Area","IA","ac",{"$f":"1*0.84","v":0.84}]
{"$rows_left_out":60}
{"sheet":"Output_Summary","index":9,"n_rows":38,"n_cols":10,"rows_kept":38,"cut":false,"hidden":false,"merged":[[26,0,30,0],[3,0,6,0],[1,0,1,9],[31,0,36,0],[0,0,0,9],[15,0,20,0],[21,0,25,0],[7,0,8,0],[9,0,11,0]]}
[]
["Summary Output\nUNHSC Performance Curve Calculator v2.2"]
[null,"Parameter","Abbrev.","Units","SCM 1","SCM 2","SCM 3","SCM 4","SCM 5","TOTAL"]
["Location","ID","-","-",{"$f":"IF(ISBLANK(Input_Design_Output!F2),\"\",Input_Design_Output!F2)","v":"Example Bioretention"},{"$f":"IF(ISBLANK(Input_Design_Output!G2),\"\",Input_Design_Output!G2)","v":""},{"$f":"IF(ISBLANK(Input_Design_Output!H2),\"\",Input_Design_Output!H2)","v":""},{"$f":"IF(ISBLANK(Input_Design_Output!I2),\"\",Input_Design_Output!I2)","v":""},{"$f":"IF(ISBLANK(Input_Design_Output!J2),\"\",Input_Design_Output!J2)","v":""}]
[null,"Date","-","-",{"$f":"IF(ISBLANK(Input_Design_Output!F3),\"\",Input_Design_Output!F3)","v":"2021-07-01"},{"$f":"IF(ISBLANK(Input_Design_Output!G3),\"\",Input_Design_Output!G3)","v":""},{"$f":"IF(ISBLANK(Input_Design_Output!H3),\"\",Input_Design_Output!H3)","v":""},{"$f":"IF(ISBLANK(Input_Design_Output!I3),\"\",Input_Design_Output!I3)","v":""},{"$f":"IF(ISBLANK(Input_Design_Output!J3),\"\",Input_Design_Output!J3)","v":""}]
[null,"Location","-","-",{"$f":"IF(ISBLANK(Input_Design_Output!F4),\"\",Input_Design_Output!F4)","v":""},{"$f":"IF(ISBLANK(Input_Design_Output!G4),\"\",Input_Design_Output!G4)","v":""},{"$f":"IF(ISBLANK(Input_Design_Output!H4),\"\",Input_Design_Output!H4)","v":""},{"$f":"IF(ISBLANK(Input_Design_Output!I4),\"\",Input_Design_Output!I4)","v":""},{"$f":"IF(ISBLANK(Input_Design_Output!J4),\"\",Input_Design_Output!J4)","v":""}]
[null,"Description/Notes","-","-",{"$f":"IF(ISBLANK(Input_Design_Output!F5),\"\",Input_Design_Output!F5)","v":""},{"$f":"IF(ISBLANK(Input_Design_Output!G5),\"\",Input_Design_Output!G5)","v":""},{"$f":"IF(ISBLANK(Input_Design_Output!H5),\"\",Input_Design_Output!H5)","v":""},{"$f":"IF(ISBLANK(Input_Design_Output!I5),\"\",Input_Design_Output!I5)","v":""},{"$f":"IF(ISBLANK(Input_Design_Output!J5),\"\",Input_Design_Output!J5)","v":""}]
["Watershed","Impervious Drainage Area","IA","ac",{"$f":"IF(ISBLANK(Input_Design_Output!F8),\"\",Input_Design_Output!F8)","v":0.84},{"$f":"IF(ISBLANK(Input_Design_Output!G8),\"\",Input_Design_Output!G8)","v":""},{"$f":"IF(ISBLANK(Input_Design_Output!H8),\"\",Input_Design_Output!H8)","v":""},{"$f":"IF(ISBLANK(Input_Design_Output!I8),\"\",Input_Design_Output!I8)","v":""},{"$f":"IF(ISBLANK(Input_Design_Output!J8),\"\",Input_Design_Output!J8)","v":""},{"$f":"SUM(E8:I8)","v":0.84}]
{"$rows_left_out":30}